Reaction Details
TargetSerine/threonine-protein kinase Chk1
LigandBDBM50218701
Substrate/Competitorn/a
Meas. Tech.ChEMBL_444965 (CHEMBL894121)
IC50 2±n/a nM
Citation Wang, LSullivan, GMHexamer, LAHasvold, LAThalji, RPrzytulinska, MTao, ZFLi, GChen, ZXiao, ZGu, WZXue, JBui, MHMerta, PKovar, PBouska, JJZhang, HPark, CStewart, KDSham, HLSowin, TJRosenberg, SHLin, NH Design, synthesis, and biological activity of 5,10-dihydro-dibenzo[b,e][1,4]diazepin-11-one-based potent and selective Chk-1 inhibitors. J Med Chem50:4162-76 (2007) 
 
Serine/threonine-protein kinase Chk1
Name:Serine/threonine-protein kinase Chk1
Type:Enzyme Catalytic Domain
Mol. Mass.:54443.02
Organism:Homo sapiens (Human)
Description:gi_166295192
Residue:476
BDBM50218701
NameBDBM50218701
Synonyms:8-(1,1-dioxo-1l6-isothiazolidin-2-yl)-3-(3-methoxy-4-nitrophenyl)-5,10-dihydro-dibenzo[b,e][1,4]diazepin-11-one | CHEMBL242412
TypeSmall organic molecule
Emp. Form.C23H22N4O4S
Mol. Mass.450.51
SMILESCOc1cc(ccc1N)-c1ccc2c(Nc3ccc(cc3NC2=O)N2CCCS2(=O)=O)c1