Reaction Details
TargetSerine/threonine-protein kinase Chk1
LigandBDBM50218739
Substrate/Competitorn/a
Meas. Tech.ChEMBL_444965 (CHEMBL894121)
IC50>50000±n/a nM
Citation Wang, LSullivan, GMHexamer, LAHasvold, LAThalji, RPrzytulinska, MTao, ZFLi, GChen, ZXiao, ZGu, WZXue, JBui, MHMerta, PKovar, PBouska, JJZhang, HPark, CStewart, KDSham, HLSowin, TJRosenberg, SHLin, NH Design, synthesis, and biological activity of 5,10-dihydro-dibenzo[b,e][1,4]diazepin-11-one-based potent and selective Chk-1 inhibitors. J Med Chem50:4162-76 (2007) 
 
Serine/threonine-protein kinase Chk1
Name:Serine/threonine-protein kinase Chk1
Type:Enzyme Catalytic Domain
Mol. Mass.:54443.02
Organism:Homo sapiens (Human)
Description:gi_166295192
Residue:476
BDBM50218739
NameBDBM50218739
Synonyms:5,5-dioxo-5,10-dihydro-5lambda*6*-dibenzo[b,f][1,4]thiazepin-11-one | CHEMBL242417
TypeSmall organic molecule
Emp. Form.C13H9NO3S
Mol. Mass.259.28
SMILESO=C1Nc2ccccc2S(=O)(=O)c2ccccc12