Reaction Details
TargetSerine/threonine-protein kinase Chk1
LigandBDBM50218734
Substrate/Competitorn/a
Meas. Tech.ChEMBL_444965 (CHEMBL894121)
IC50 17000±n/a nM
Citation Wang, LSullivan, GMHexamer, LAHasvold, LAThalji, RPrzytulinska, MTao, ZFLi, GChen, ZXiao, ZGu, WZXue, JBui, MHMerta, PKovar, PBouska, JJZhang, HPark, CStewart, KDSham, HLSowin, TJRosenberg, SHLin, NH Design, synthesis, and biological activity of 5,10-dihydro-dibenzo[b,e][1,4]diazepin-11-one-based potent and selective Chk-1 inhibitors. J Med Chem50:4162-76 (2007) 
 
Serine/threonine-protein kinase Chk1
Name:Serine/threonine-protein kinase Chk1
Type:Enzyme Catalytic Domain
Mol. Mass.:54443.02
Organism:Homo sapiens (Human)
Description:gi_166295192
Residue:476
BDBM50218734
NameBDBM50218734
Synonyms:8-chloro-5,10-dihydro-dibenzo[b,e][1,4]diazepin-11-one CHEMBL396034 | Chk1_8
TypeSmall organic molecule
Emp. Form.C13H9ClN2O
Mol. Mass.244.676
SMILESClc1ccc2Nc3ccccc3C(=O)Nc2c1