Reaction Details
TargetSerine/threonine-protein kinase Chk1
LigandBDBM50218721
Substrate/Competitorn/a
Meas. Tech.ChEMBL_444965 (CHEMBL894121)
IC50 91±n/a nM
Citation Wang, LSullivan, GMHexamer, LAHasvold, LAThalji, RPrzytulinska, MTao, ZFLi, GChen, ZXiao, ZGu, WZXue, JBui, MHMerta, PKovar, PBouska, JJZhang, HPark, CStewart, KDSham, HLSowin, TJRosenberg, SHLin, NH Design, synthesis, and biological activity of 5,10-dihydro-dibenzo[b,e][1,4]diazepin-11-one-based potent and selective Chk-1 inhibitors. J Med Chem50:4162-76 (2007) 
 
Serine/threonine-protein kinase Chk1
Name:Serine/threonine-protein kinase Chk1
Type:Enzyme Catalytic Domain
Mol. Mass.:54443.02
Organism:Homo sapiens (Human)
Description:gi_166295192
Residue:476
BDBM50218721
NameBDBM50218721
Synonyms:3-(4-chloro-3-methoxy-phenyl)-5,10-dihydro-dibenzo[b,e][1,4]-diazepin-11-one | CHEMBL397683
TypeSmall organic molecule
Emp. Form.C20H15ClN2O2
Mol. Mass.350.798
SMILESCOc1cc(ccc1Cl)-c1ccc2c(Nc3ccccc3NC2=O)c1