Reaction Details
TargetSerine/threonine-protein kinase Chk1
LigandBDBM50218711
Substrate/Competitorn/a
Meas. Tech.ChEMBL_444966 (CHEMBL894122)
EC50>59300±n/a nM
Citation Wang, LSullivan, GMHexamer, LAHasvold, LAThalji, RPrzytulinska, MTao, ZFLi, GChen, ZXiao, ZGu, WZXue, JBui, MHMerta, PKovar, PBouska, JJZhang, HPark, CStewart, KDSham, HLSowin, TJRosenberg, SHLin, NH Design, synthesis, and biological activity of 5,10-dihydro-dibenzo[b,e][1,4]diazepin-11-one-based potent and selective Chk-1 inhibitors. J Med Chem50:4162-76 (2007) 
 
Serine/threonine-protein kinase Chk1
Name:Serine/threonine-protein kinase Chk1
Type:Enzyme Catalytic Domain
Mol. Mass.:54443.02
Organism:Homo sapiens (Human)
Description:gi_166295192
Residue:476
BDBM50218711
NameBDBM50218711
Synonyms:8-hydroxy-3-(3-methoxy-4-nitrophenyl)-5H-dibenzo[b,e][1,4]-diazepin-11(10H)-one | CHEMBL243491
TypeSmall organic molecule
Emp. Form.C20H17N3O3
Mol. Mass.347.3673
SMILESCOc1cc(ccc1N)-c1ccc2c(Nc3ccc(O)cc3NC2=O)c1