Reaction Details
TargetTyrosine-protein phosphatase non-receptor type 1
LigandBDBM50219569
Substrate/Competitorn/a
Meas. Tech.ChEMBL_445832 (CHEMBL896126)
Ki 3±n/a nM
Citation Wilson, DPWan, ZKXu, WXKirincich, SJFollows, BCJoseph-McCarthy, DForeman, KMoretto, AWu, JZhu, MBinnun, EZhang, YLTam, MErbe, DVTobin, JXu, XLeung, LShilling, ATam, SYMansour, TSLee, J Structure-based optimization of protein tyrosine phosphatase 1B inhibitors: from the active site to the second phosphotyrosine binding site. J Med Chem50:4681-98 (2007) 
 
Tyrosine-protein phosphatase non-receptor type 1
Name:Tyrosine-protein phosphatase non-receptor type 1
Type:Protein phosphatase
Mol. Mass.:49963.76
Organism:Homo sapiens (Human)
Description:Human recombinant GST-fusion PTP1B (1-435).
Residue:435
BDBM50219569
NameBDBM50219569
Synonyms:4-bromo-3-carboxymethoxy-5-(3-{[1-(2,6-dimethylphenylcarbamoyl)piperidin-4-ylmethyl]amino}phenyl)thiophene-2-carboxylic acid | CHEMBL243268
TypeSmall organic molecule
Emp. Form.C28H30BrN3O6S
Mol. Mass.616.523
SMILESCc1cccc(C)c1NC(=O)N1CCC(CNc2cccc(c2)-c2sc(C(O)=O)c(OCC(O)=O)c2Br)CC1