Reaction Details
TargetReceptor-type tyrosine-protein phosphatase C
LigandBDBM50219566
Substrate/Competitorn/a
Meas. Tech.ChEMBL_445834 (CHEMBL896128)
Ki 77000±n/a nM
Citation Wilson, DPWan, ZKXu, WXKirincich, SJFollows, BCJoseph-McCarthy, DForeman, KMoretto, AWu, JZhu, MBinnun, EZhang, YLTam, MErbe, DVTobin, JXu, XLeung, LShilling, ATam, SYMansour, TSLee, J Structure-based optimization of protein tyrosine phosphatase 1B inhibitors: from the active site to the second phosphotyrosine binding site. J Med Chem50:4681-98 (2007) 
 
Receptor-type tyrosine-protein phosphatase C
Name:Receptor-type tyrosine-protein phosphatase C
Type:Protein
Mol. Mass.:147474.19
Organism:Homo sapiens (Human)
Description:P08575
Residue:1306
BDBM50219566
NameBDBM50219566
Synonyms:4-bromo-3-carboxymethoxy-5-[3-(1-phenylmethanesulfonylpiperidin-4-ylamino)phenyl]thiophene-2-carboxylic acid 5-(3-{[1-(BENZYLSULFONYL)PIPERIDIN-4-YL]AMINO}PHENYL)-4-BROMO-3-(CARBOXYMETHOXY)THIOPHENE-2-CARBOXYLIC ACID | CHEMBL541214
TypeSmall organic molecule
Emp. Form.C25H25BrN2O7S2
Mol. Mass.609.509
SMILESOC(=O)COc1c(Br)c(sc1C(O)=O)-c1cccc(NC2CCN(CC2)S(=O)(=O)Cc2ccccc2)c1