Reaction Details
TargetGlycogen synthase kinase-3 beta
LigandBDBM50220370
Substrate/Competitorn/a
Meas. Tech.ChEMBL_457307 (CHEMBL941840)
IC50 70±n/a nM
Citation Shin, DLee, SCHeo, YSLee, WYCho, YSKim, YEHyun, YLCho, JMLee, YSRo, S Design and synthesis of 7-hydroxy-1H-benzoimidazole derivatives as novel inhibitors of glycogen synthase kinase-3beta. Bioorg Med Chem Lett17:5686-9 (2007) 
 
Glycogen synthase kinase-3 beta
Name:Glycogen synthase kinase-3 beta
Type:Enzyme
Mol. Mass.:46756.38
Organism:Homo sapiens (Human)
Description:P49841
Residue:420
BDBM50220370
NameBDBM50220370
Synonyms:3-(1-methylindol-3-yl)-4-[3-(2-aminoethoxy)phenyl]-1Hpyrrole-2,5-dione | CHEMBL250509
TypeSmall organic molecule
Emp. Form.C21H19N3O3
Mol. Mass.361.3939
SMILESCn1cc(C2=C(C(=O)NC2=O)c2cccc(OCCN)c2)c2ccccc12