Reaction Details
Target5-hydroxytryptamine receptor 1A
LigandBDBM50220914
Substrate/Competitorn/a
Meas. Tech.ChEMBL_449378 (CHEMBL899647)
Ki 3.6±n/a nM
Citation Krushinski, JHSchaus, JMThompson, DCCalligaro, DONelson, DLLuecke, SHWainscott, DBWong, DT Indoloxypropanolamine analogues as 5-HT(1A) receptor antagonists. Bioorg Med Chem Lett17:5600-4 (2007) 
 
5-hydroxytryptamine receptor 1A
Name:5-hydroxytryptamine receptor 1A
Type:n/a
Mol. Mass.:46122.49
Organism:Homo sapiens (Human)
Description:n/a
Residue:422
BDBM50220914
NameBDBM50220914
Synonyms:1-(1H-indol-4-yloxy)-3-(cyclohexylamino)propan-2-ol | CHEMBL396185
TypeSmall organic molecule
Emp. Form.C17H24N2O2
Mol. Mass.288.3847
SMILESOC(CNC1CCCCC1)COc1cccc2[nH]ccc12