Reaction Details
Target5-hydroxytryptamine receptor 1A
LigandBDBM50220917
Substrate/Competitorn/a
Meas. Tech.ChEMBL_449378 (CHEMBL899647)
Ki 9.3±n/a nM
Citation Krushinski, JHSchaus, JMThompson, DCCalligaro, DONelson, DLLuecke, SHWainscott, DBWong, DT Indoloxypropanolamine analogues as 5-HT(1A) receptor antagonists. Bioorg Med Chem Lett17:5600-4 (2007) 
 
5-hydroxytryptamine receptor 1A
Name:5-hydroxytryptamine receptor 1A
Type:n/a
Mol. Mass.:46122.49
Organism:Homo sapiens (Human)
Description:n/a
Residue:422
BDBM50220917
NameBDBM50220917
Synonyms:1-(adamantan-1-ylamino)-3-(1H-indol-4-yloxy)-propan-2-ol | CHEMBL237572
TypeSmall organic molecule
Emp. Form.C21H28N2O2
Mol. Mass.340.4592
SMILESOC(CNC12CC3CC(CC(C3)C1)C2)COc1cccc2[nH]ccc12