Reaction Details
TargetBeta-1 adrenergic receptor
LigandBDBM50220911
Substrate/Competitorn/a
Meas. Tech.ChEMBL_449388 (CHEMBL899646)
Ki 7.9±n/a nM
Citation Krushinski, JHSchaus, JMThompson, DCCalligaro, DONelson, DLLuecke, SHWainscott, DBWong, DT Indoloxypropanolamine analogues as 5-HT(1A) receptor antagonists. Bioorg Med Chem Lett17:5600-4 (2007) 
 
Beta-1 adrenergic receptor
Name:Beta-1 adrenergic receptor
Type:G Protein-Coupled Receptor (GPCR)
Mol. Mass.:51338.40
Organism:Homo sapiens (Human)
Description:P08588
Residue:477
BDBM50220911
NameBDBM50220911
Synonyms:(S)-1-(adamantan-1-ylamino)-3-(1H-indol-4-yloxy)-propan-2-ol | CHEMBL236514
TypeSmall organic molecule
Emp. Form.C21H28N2O2
Mol. Mass.340.4592
SMILESO[C@@H](CNC12CC3CC(CC(C3)C1)C2)COc1cccc2[nH]ccc12