Reaction Details
TargetAngiopoietin-1 receptor
LigandBDBM50024794
Substrate/Competitorn/a
Meas. Tech.ChEMBL_449556 (CHEMBL899826)
IC50 95±n/a nM
Citation Johnson, NWSemones, MAdams, JLHansbury, MWinkler, J Optimization of triarylimidazoles for Tie2: influence of conformation on potency. Bioorg Med Chem Lett17:5514-7 (2007) 
 
Angiopoietin-1 receptor
Name:Angiopoietin-1 receptor
Type:Enzyme
Mol. Mass.:125835.70
Organism:Homo sapiens (Human)
Description:Q02763
Residue:1124
BDBM50024794
NameBDBM50024794
Synonyms:CHEMBL2448122
TypeSmall organic molecule
Emp. Form.C27H23N3O2S
Mol. Mass.453.555
SMILESCOc1ccc2cc(ccc2c1)-c1nc([nH]c1-c1ccncc1)-c1ccc(cc1C)[S@+](C)[O-]