Reaction Details
TargetAngiopoietin-1 receptor
LigandBDBM50217603
Substrate/Competitorn/a
Meas. Tech.ChEMBL_449556 (CHEMBL899826)
IC50>20000±n/a nM
Citation Johnson, NWSemones, MAdams, JLHansbury, MWinkler, J Optimization of triarylimidazoles for Tie2: influence of conformation on potency. Bioorg Med Chem Lett17:5514-7 (2007) 
 
Angiopoietin-1 receptor
Name:Angiopoietin-1 receptor
Type:Enzyme
Mol. Mass.:125835.70
Organism:Homo sapiens (Human)
Description:Q02763
Residue:1124
BDBM50217603
NameBDBM50217603
Synonyms:4-(4-(6-methoxynaphthalen-2-yl)-2-(4-(methylsulfinyl)phenyl)-1H-imidazol-5-yl)pyridine | CHEMBL237352
TypeSmall organic molecule
Emp. Form.C26H21N3O2S
Mol. Mass.439.529
SMILESCOc1ccc2cc(ccc2c1)-c1[nH]c(nc1-c1ccncc1)-c1ccc(cc1)S(C)=O