Reaction Details
TargetProtein kinase C beta type
LigandBDBM50221346
Substrate/Competitorn/a
Meas. Tech.ChEMBL_449567 (CHEMBL899837)
IC50>30000±n/a nM
Citation Johnson, NWSemones, MAdams, JLHansbury, MWinkler, J Optimization of triarylimidazoles for Tie2: influence of conformation on potency. Bioorg Med Chem Lett17:5514-7 (2007) 
 
Protein kinase C beta type
Name:Protein kinase C beta type
Type:Enzyme
Mol. Mass.:76873.67
Organism:Homo sapiens (Human)
Description:The recombinant human PKC enzymes were produced using a baculovirus expression system in SF9 cells
Residue:671
BDBM50221346
NameBDBM50221346
Synonyms:4-[2-(4-methanesulfinyl-2-methyl-phenyl)-5-(6-methoxy-naphthalen-2-yl)-1-methyl-3H-imidazol-4-yl]-pyridine | CHEMBL237570
TypeSmall organic molecule
Emp. Form.C28H25N3O2S
Mol. Mass.467.582
SMILESCOc1ccc2cc(ccc2c1)-c1c(nc(-c2ccc(cc2C)S(C)=O)n1C)-c1ccncc1