Reaction Details
TargetDelta-type opioid receptor
LigandBDBM50221414
Substrate/Competitorn/a
Meas. Tech.ChEMBL_457568 (CHEMBL922768)
Ki 5.1±n/a nM
Citation Metcalf, MDCoop, A 5'-halogenated analogs of oxymorphindole. Bioorg Med Chem Lett17:5916-7 (2007) 
 
Delta-type opioid receptor
Name:Delta-type opioid receptor
Type:G Protein-Coupled Receptor (GPCR)
Mol. Mass.:40382.98
Organism:Homo sapiens (Human)
Description:Competition binding assays were carried out using membrane preparations from transfected HN9.10 cells that constitutively expressed the delta opioid receptor.
Residue:372
BDBM50221414
NameBDBM50221414
Synonyms:(1S,2S,13R,21R)-7-chloro-22-methyl-14-oxa-11,22-diazaheptacyclo[13.9.1.0^{1,13}.0^{2,21}.0^{4,12}.0^{5,10}.0^{19,25}]pentacosa-4(12),5(10),6,8,15,17,19(25)-heptaene-2,16-diol | CHEMBL248840
TypeSmall organic molecule
Emp. Form.C23H21ClN2O3
Mol. Mass.408.877
SMILESCN1CC[C@@]23[C@H]4Oc5c2c(C[C@@H]1[C@]3(O)Cc1c4[nH]c2ccc(Cl)cc12)ccc5O