Reaction Details
TargetMu-type opioid receptor
LigandBDBM50221417
Substrate/Competitorn/a
Meas. Tech.ChEMBL_457575 (CHEMBL922775)
Ki 66±n/a nM
Citation Metcalf, MDCoop, A 5'-halogenated analogs of oxymorphindole. Bioorg Med Chem Lett17:5916-7 (2007) 
 
Mu-type opioid receptor
Name:Mu-type opioid receptor
Type:G Protein-Coupled Receptor (GPCR)
Mol. Mass.:44789.51
Organism:Homo sapiens (Human)
Description:P35372
Residue:400
BDBM50221417
NameBDBM50221417
Synonyms:(1S,2S,13R,21R)-7-iodo-22-methyl-14-oxa-11,22-diazaheptacyclo[13.9.1.0^{1,13}.0^{2,21}.0^{4,12}.0^{5,10}.0^{19,25}]pentacosa-4(12),5(10),6,8,15,17,19(25)-heptaene-2,16-diol | CHEMBL427706
TypeSmall organic molecule
Emp. Form.C23H21IN2O3
Mol. Mass.500.3289
SMILESCN1CC[C@@]23[C@H]4Oc5c2c(C[C@@H]1[C@]3(O)Cc1c4[nH]c2ccc(I)cc12)ccc5O