Reaction Details
TargetKappa-type opioid receptor
LigandBDBM50221416
Substrate/Competitorn/a
Meas. Tech.ChEMBL_457569 (CHEMBL922769)
Ki 515±n/a nM
Citation Metcalf, MDCoop, A 5'-halogenated analogs of oxymorphindole. Bioorg Med Chem Lett17:5916-7 (2007) 
 
Kappa-type opioid receptor
Name:Kappa-type opioid receptor
Type:G Protein-Coupled Receptor (GPCR)
Mol. Mass.:42648.76
Organism:Homo sapiens (Human)
Description:P41145
Residue:380
BDBM50221416
NameBDBM50221416
Synonyms:22-methyl-(2S,13R)-14-oxa-11,22-diazaheptacyclo[13.9.1.01,13.02,21.04,12.05,10.019,25]pentacosa-4(12),5(10),6,8,15(25),16,18-heptaene-2,16-diol(HCl0.5H2O) (Oxymorphindole, OMI) CHEMBL401093 | OXYMORPHINDOLE
TypeSmall organic molecule
Emp. Form.C23H22N2O3
Mol. Mass.374.4324
SMILESCN1CC[C@@]23[C@H]4Oc5c2c(C[C@@H]1[C@]3(O)Cc1c4[nH]c2ccccc12)ccc5O