Reaction Details
TargetMu-type opioid receptor
LigandBDBM50221419
Substrate/Competitorn/a
Meas. Tech.ChEMBL_449624 (CHEMBL898721)
Ki 0.420000±n/a nM
Citation Shiotani, KLi, TMiyazaki, ATsuda, YYokoi, TAmbo, ASasaki, YBryant, SDLazarus, LHOkada, Y Design and synthesis of opioidmimetics containing 2',6'-dimethyl-L-tyrosine and a pyrazinone-ring platform. Bioorg Med Chem Lett17:5768-71 (2007) 
 
Mu-type opioid receptor
Name:Mu-type opioid receptor
Type:G Protein-Coupled Receptor (GPCR)
Mol. Mass.:44789.51
Organism:Homo sapiens (Human)
Description:P35372
Residue:400
BDBM50221419
NameBDBM50221419
Synonyms:(S)-2-amino-N-(4-(5-benzyl-6-methyl-3-oxo-3,4-dihydropyrazin-2-yl)butyl)-3-(4-hydroxy-2,6-dimethylphenyl)propanamide | CHEMBL392057
TypeSmall organic molecule
Emp. Form.C27H34N4O3
Mol. Mass.462.5839
SMILESCc1cc(O)cc(C)c1C[C@H](N)C(=O)NCCCCc1nc(C)c(Cc2ccccc2)[nH]c1=O