Reaction Details
TargetVascular endothelial growth factor receptor 1
LigandBDBM50221520
Substrate/Competitorn/a
Meas. Tech.ChEMBL_457648 (CHEMBL923925)
Ki>10000±n/a nM
Citation Pannala, MKher, SWilson, NGaudette, JSircar, IZhang, SHBakhirev, AYang, GYuen, PGorcsan, FSakurai, NBarbosa, MCheng, JF Synthesis and structure-activity relationship of 4-(2-aryl-cyclopropylamino)-quinoline-3-carbonitriles as EGFR tyrosine kinase inhibitors. Bioorg Med Chem Lett17:5978-82 (2007) 
 
Vascular endothelial growth factor receptor 1
Name:Vascular endothelial growth factor receptor 1
Type:Receptor Tyrosine Kinase
Mol. Mass.:150800.23
Organism:Homo sapiens (Human)
Description:P17948
Residue:1338
BDBM50221520
NameBDBM50221520
Synonyms:6-(3-(morpholinomethyl)phenyl)-4-((1R,2S)-2-phenylcyclopropylamino)quinoline-3-carbonitrile | CHEMBL245799
TypeSmall organic molecule
Emp. Form.C30H28N4O
Mol. Mass.460.5695
SMILESN#Cc1cnc2ccc(cc2c1N[C@@H]1C[C@H]1c1ccccc1)-c1cccc(CN2CCOCC2)c1