Reaction Details
TargetVascular endothelial growth factor receptor 1
LigandBDBM50221526
Substrate/Competitorn/a
Meas. Tech.ChEMBL_457648 (CHEMBL923925)
Ki>10000±n/a nM
Citation Pannala, MKher, SWilson, NGaudette, JSircar, IZhang, SHBakhirev, AYang, GYuen, PGorcsan, FSakurai, NBarbosa, MCheng, JF Synthesis and structure-activity relationship of 4-(2-aryl-cyclopropylamino)-quinoline-3-carbonitriles as EGFR tyrosine kinase inhibitors. Bioorg Med Chem Lett17:5978-82 (2007) 
 
Vascular endothelial growth factor receptor 1
Name:Vascular endothelial growth factor receptor 1
Type:Receptor Tyrosine Kinase
Mol. Mass.:150800.23
Organism:Homo sapiens (Human)
Description:P17948
Residue:1338
BDBM50221526
NameBDBM50221526
Synonyms:6-methoxy-4-((1R,2S)-2-phenylcyclopropylamino)quinoline-3-carbonitrile | CHEMBL401644
TypeSmall organic molecule
Emp. Form.C20H17N3O
Mol. Mass.315.3685
SMILESCOc1ccc2ncc(C#N)c(N[C@@H]3C[C@H]3c3ccccc3)c2c1