Reaction Details
TargetVascular endothelial growth factor receptor 1
LigandBDBM50221518
Substrate/Competitorn/a
Meas. Tech.ChEMBL_457648 (CHEMBL923925)
Ki 1600±n/a nM
Citation Pannala, MKher, SWilson, NGaudette, JSircar, IZhang, SHBakhirev, AYang, GYuen, PGorcsan, FSakurai, NBarbosa, MCheng, JF Synthesis and structure-activity relationship of 4-(2-aryl-cyclopropylamino)-quinoline-3-carbonitriles as EGFR tyrosine kinase inhibitors. Bioorg Med Chem Lett17:5978-82 (2007) 
 
Vascular endothelial growth factor receptor 1
Name:Vascular endothelial growth factor receptor 1
Type:Receptor Tyrosine Kinase
Mol. Mass.:150800.23
Organism:Homo sapiens (Human)
Description:P17948
Residue:1338
BDBM50221518
NameBDBM50221518
Synonyms:6,7-dimethoxy-4-((1R,2S)-2-phenylcyclopropylamino)quinoline-3-carbonitrile | CHEMBL248044
TypeSmall organic molecule
Emp. Form.C21H19N3O2
Mol. Mass.345.3945
SMILESCOc1cc2ncc(C#N)c(N[C@@H]3C[C@H]3c3ccccc3)c2cc1OC