Reaction Details
TargetEpidermal growth factor receptor
LigandBDBM50221532
Substrate/Competitorn/a
Meas. Tech.ChEMBL_457644 (CHEMBL923921)
Ki 80±n/a nM
Citation Pannala, MKher, SWilson, NGaudette, JSircar, IZhang, SHBakhirev, AYang, GYuen, PGorcsan, FSakurai, NBarbosa, MCheng, JF Synthesis and structure-activity relationship of 4-(2-aryl-cyclopropylamino)-quinoline-3-carbonitriles as EGFR tyrosine kinase inhibitors. Bioorg Med Chem Lett17:5978-82 (2007) 
 
Epidermal growth factor receptor
Name:Epidermal growth factor receptor
Type:Receptor Kinase Domain
Mol. Mass.:134279.59
Organism:Homo sapiens (Human)
Description:P00533
Residue:1210
BDBM50221532
NameBDBM50221532
Synonyms:6,7-dimethoxy-4-((1R,2S)-2-(4-phenoxyphenyl)cyclopropylamino)quinoline-3-carbonitrile | CHEMBL245996
TypeSmall organic molecule
Emp. Form.C27H23N3O3
Mol. Mass.437.4898
SMILESCOc1cc2ncc(C#N)c(N[C@@H]3C[C@H]3c3ccc(Oc4ccccc4)cc3)c2cc1OC