Reaction Details
TargetTyrosine-protein kinase ABL1
LigandBDBM50221547
Substrate/Competitorn/a
Meas. Tech.ChEMBL_457651 (CHEMBL923928)
Ki 0.062±n/a nM
Citation Cao, JFine, RGritzen, CHood, JKang, XKlebansky, BLohse, DMak, CCMcPherson, ANoronha, GPalanki, MSPathak, VPRenick, JSoll, RZeng, BZhu, H The design and preliminary structure-activity relationship studies of benzotriazines as potent inhibitors of Abl and Abl-T315I enzymes. Bioorg Med Chem Lett17:5812-8 (2007) 
 
Tyrosine-protein kinase ABL1
Name:Tyrosine-protein kinase ABL1
Type:Enzyme
Mol. Mass.:122897.30
Organism:Homo sapiens (Human)
Description:P00519
Residue:1130
BDBM50221547
NameBDBM50221547
Synonyms:4-chloro-3-(5-methyl-3-(4-(3-(pyrrolidin-1-yl)propyl)phenylamino)benzo[e][1,2,4]triazin-7-yl)phenol CHEMBL250213
TypeSmall organic molecule
Emp. Form.C27H28ClN5O
Mol. Mass.473.997
SMILESCc1cc(cc2nnc(Nc3ccc(CCCN4CCCC4)cc3)nc12)-c1cc(O)ccc1Cl