Reaction Details
TargetTyrosine-protein kinase ABL1
LigandBDBM50198826
Substrate/Competitorn/a
Meas. Tech.ChEMBL_457651 (CHEMBL923928)
Ki 5±n/a nM
Citation Cao, JFine, RGritzen, CHood, JKang, XKlebansky, BLohse, DMak, CCMcPherson, ANoronha, GPalanki, MSPathak, VPRenick, JSoll, RZeng, BZhu, H The design and preliminary structure-activity relationship studies of benzotriazines as potent inhibitors of Abl and Abl-T315I enzymes. Bioorg Med Chem Lett17:5812-8 (2007) 
 
Tyrosine-protein kinase ABL1
Name:Tyrosine-protein kinase ABL1
Type:Enzyme
Mol. Mass.:122897.30
Organism:Homo sapiens (Human)
Description:P00519
Residue:1130
BDBM50198826
NameBDBM50198826
Synonyms:4-(7-(2-chloro-6-hydroxyphenyl)-5-methylbenzo[e][1,2,4]triazin-3-ylamino)-N-(2-(pyrrolidin-1-yl)ethyl)benzenesulfonamide US8481536, 549
TypeSmall organic molecule
Emp. Form.C26H27ClN6O3S
Mol. Mass.539.049
SMILESCc1cc(cc2nnc(Nc3ccc(cc3)S(=O)(=O)NCCN3CCCC3)nc12)-c1c(O)cccc1Cl