Reaction Details
TargetNeuronal acetylcholine receptor subunit alpha-4/beta-2
LigandBDBM50221885
Substrate/Competitorn/a
Meas. Tech.ChEMBL_446270 (CHEMBL895373)
Ki 16±n/a nM
Citation Guandalini, LNorcini, MVarani, KPistolozzi, MGotti, CBazzicalupi, CMartini, EDei, SManetti, DScapecchi, STeodori, EBertucci, CGhelardini, CRomanelli, MN Design, synthesis, and preliminary pharmacological evaluation of new quinoline derivatives as nicotinic ligands. J Med Chem50:4993-5002 (2007) 
 
Neuronal acetylcholine receptor subunit alpha-4/beta-2
Name:Neuronal acetylcholine receptor subunit alpha-4/beta-2
Type:n/a
Mol. Mass.:n/a
Description:n/a
Components:This complex has 0 components.
Component 1
Name:Neuronal acetylcholine receptor subunit alpha-4
Synonyms:ACHA4_RAT Cholinergic, Nicotinic Alpha4Beta2 Chrna4 Neuronal acetylcholine receptor (alpha4beta2 nAChR) Neuronal acetylcholine receptor subunit alpha 4 beta 2 | Neuronal acetylcholine receptor subunit alpha-4
Type:Enzyme
Mol. Mass.:70196.44
Organism:Rattus norvegicus (Rat)
Description:P09483
Residue:630
Component 2
Name:Neuronal acetylcholine receptor subunit beta-2
Synonyms:ACHB2_RAT Chrnb2 Neuronal acetylcholine receptor non-alpha-1 chain
Type:Enzyme
Mol. Mass.:56910.32
Organism:Rattus norvegicus (Rat)
Description:P12390
Residue:500
BDBM50221885
NameBDBM50221885
Synonyms:(S)-1,1-Dimethyl-2-quinolin-6-yl-pyrrolidinium; iodide | CHEMBL389786
TypeSmall organic molecule
Emp. Form.C15H19N2
Mol. Mass.227.3242
SMILESC[N+]1(C)CCC[C@H]1c1ccc2ncccc2c1