Reaction Details
TargetDipeptidyl peptidase 4
LigandBDBM50221972
Substrate/Competitorn/a
Meas. Tech.ChEMBL_449743 (CHEMBL898850)
IC50 4±n/a nM
Citation Kaelin, DESmenton, ALEiermann, GJHe, HLeiting, BLyons, KAPatel, RAPatel, SBPetrov, AScapin, GWu, JKThornberry, NAWeber, AEDuffy, JL 4-arylcyclohexylalanine analogs as potent, selective, and orally active inhibitors of dipeptidyl peptidase IV. Bioorg Med Chem Lett17:5806-11 (2007) 
 
Dipeptidyl peptidase 4
Name:Dipeptidyl peptidase 4
Type:Enzyme
Mol. Mass.:88271.01
Organism:Homo sapiens (Human)
Description:P27487
Residue:766
BDBM50221972
NameBDBM50221972
Synonyms:(2S,3S)-2-(4-([1,2,4]triazolo[1,5-a]pyridin-6-yl)phenyl)-3-amino-4-((S)-3-fluoropyrrolidin-1-yl)-N,N-dimethyl-4-oxobutanamide CHEMBL237337
TypeSmall organic molecule
Emp. Form.C22H25FN6O2
Mol. Mass.424.4713
SMILESCN(C)C(=O)[C@H]([C@H](N)C(=O)N1CC[C@H](F)C1)c1ccc(cc1)-c1ccc2ncnn2c1