Reaction Details
TargetProteinase-activated receptor 1
LigandBDBM50222043
Substrate/Competitorn/a
Meas. Tech.ChEMBL_446321 (CHEMBL895431)
IC50 15.5±n/a nM
Citation Chelliah, MVChackalamannil, SXia, YEagen, KClasby, MCGao, XGreenlee, WAhn, HSAgans-Fantuzzi, JBoykow, GHsieh, YBryant, MPalamanda, JChan, TMHesk, DChintala, M Heterotricyclic himbacine analogs as potent, orally active thrombin receptor (protease activated receptor-1) antagonists. J Med Chem50:5147-60 (2007) 
 
Proteinase-activated receptor 1
Name:Proteinase-activated receptor 1
Type:Protein
Mol. Mass.:47450.07
Organism:Homo sapiens (Human)
Description:P25116
Residue:425
BDBM50222043
NameBDBM50222043
Synonyms:(1R,3aR,4aS,8aS,9S,9aS)-6-(cyclopropylcarbonyl)-9-[(e)-2-[5-(3-fluorophenyl)-2-pyridinyl]ethenyl]-decahydro-1-methylfuro-[3,4-g]isoquinolin-3(1H)-one | CHEMBL244109
TypeSmall organic molecule
Emp. Form.C29H31FN2O3
Mol. Mass.474.5664
SMILESC[C@H]1OC(=O)[C@@H]2C[C@@H]3CN(CC[C@H]3[C@H](\C=C\c3ccc(cn3)-c3cccc(F)c3)[C@H]12)C(=O)C1CC1