Reaction Details
TargetCannabinoid receptor 2
LigandBDBM50222790
Substrate/Competitorn/a
Meas. Tech.ChEMBL_458033 (CHEMBL924302)
Ki 23.3±n/a nM
Citation Pagé, DYang, HBrown, WWalpole, CFleurent, MFyfe, MGaudreault, FSt-Onge, S New 1,2,3,4-tetrahydropyrrolo[3,4-b]indole derivatives as selective CB2 receptor agonists. Bioorg Med Chem Lett17:6183-7 (2007) 
 
Cannabinoid receptor 2
Name:Cannabinoid receptor 2
Type:G Protein-Coupled Receptor (GPCR)
Mol. Mass.:39690.94
Organism:Homo sapiens (Human)
Description:P34972
Residue:360
BDBM50222790
NameBDBM50222790
Synonyms:(4-allyl-2-cyclopentyl-1,2,3,4-tetrahydropyrrolo[3,4-b]indol-7-yl)(4-methylpiperidin-1-yl)methanone | CHEMBL250026
TypeSmall organic molecule
Emp. Form.C25H33N3O
Mol. Mass.391.549
SMILESCC1CCN(CC1)C(=O)c1ccc2n(CC=C)c3CN(Cc3c2c1)C1CCCC1