Reaction Details
TargetCannabinoid receptor 2
LigandBDBM50222802
Substrate/Competitorn/a
Meas. Tech.ChEMBL_458033 (CHEMBL924302)
Ki 107±n/a nM
Citation Pagé, DYang, HBrown, WWalpole, CFleurent, MFyfe, MGaudreault, FSt-Onge, S New 1,2,3,4-tetrahydropyrrolo[3,4-b]indole derivatives as selective CB2 receptor agonists. Bioorg Med Chem Lett17:6183-7 (2007) 
 
Cannabinoid receptor 2
Name:Cannabinoid receptor 2
Type:G Protein-Coupled Receptor (GPCR)
Mol. Mass.:39690.94
Organism:Homo sapiens (Human)
Description:P34972
Residue:360
BDBM50222802
NameBDBM50222802
Synonyms:2-cyclopentyl-4-(ethylsulfonyl)-N-isopropyl-N-methyl-1,2,3,4-tetrahydropyrrolo[3,4-b]indole-7-carboxamide | CHEMBL249786
TypeSmall organic molecule
Emp. Form.C22H31N3O3S
Mol. Mass.417.565
SMILESCCS(=O)(=O)n1c2CN(Cc2c2cc(ccc12)C(=O)N(C)C(C)C)C1CCCC1