Reaction Details
TargetCannabinoid receptor 2
LigandBDBM50222809
Substrate/Competitorn/a
Meas. Tech.ChEMBL_458035 (CHEMBL924304)
EC50 2.7±n/a nM
Citation Pagé, DYang, HBrown, WWalpole, CFleurent, MFyfe, MGaudreault, FSt-Onge, S New 1,2,3,4-tetrahydropyrrolo[3,4-b]indole derivatives as selective CB2 receptor agonists. Bioorg Med Chem Lett17:6183-7 (2007) 
 
Cannabinoid receptor 2
Name:Cannabinoid receptor 2
Type:G Protein-Coupled Receptor (GPCR)
Mol. Mass.:39690.94
Organism:Homo sapiens (Human)
Description:P34972
Residue:360
BDBM50222809
NameBDBM50222809
Synonyms:(2-butyl-4-(ethylsulfonyl)-1,2,3,4-tetrahydropyrrolo[3,4-b]indol-7-yl)(4-methylpiperidin-1-yl)methanone | CHEMBL250808
TypeSmall organic molecule
Emp. Form.C23H33N3O3S
Mol. Mass.431.591
SMILESCCCCN1Cc2c(C1)c1cc(ccc1n2S(=O)(=O)CC)C(=O)N1CCC(C)CC1