Reaction Details
TargetCannabinoid receptor 1
LigandBDBM50222801
Substrate/Competitorn/a
Meas. Tech.ChEMBL_458032 (CHEMBL924301)
Ki 1811±n/a nM
Citation Pagé, DYang, HBrown, WWalpole, CFleurent, MFyfe, MGaudreault, FSt-Onge, S New 1,2,3,4-tetrahydropyrrolo[3,4-b]indole derivatives as selective CB2 receptor agonists. Bioorg Med Chem Lett17:6183-7 (2007) 
 
Cannabinoid receptor 1
Name:Cannabinoid receptor 1
Type:G Protein-Coupled Receptor (GPCR)
Mol. Mass.:52868.96
Organism:Homo sapiens (Human)
Description:P21554
Residue:472
BDBM50222801
NameBDBM50222801
Synonyms:(2-cyclopentyl-4-methyl-1,2,3,4-tetrahydropyrrolo[3,4-b]indol-7-yl)(4-methylpiperidin-1-yl)methanone | CHEMBL249827
TypeSmall organic molecule
Emp. Form.C23H31N3O
Mol. Mass.365.5117
SMILESCC1CCN(CC1)C(=O)c1ccc2n(C)c3CN(Cc3c2c1)C1CCCC1