Reaction Details
TargetHypoxia-inducible factor 1-alpha
LigandBDBM50206600
Substrate/Competitorn/a
Meas. Tech.ChEMBL_458039 (CHEMBL924308)
IC50 700±n/a nM
Citation Boovanahalli, SKJin, XJin, YKim, JHDat, NTHong, YSLee, JHJung, SHLee, KLee, JJ Synthesis of (aryloxyacetylamino)-isonicotinic/nicotinic acid analogues as potent hypoxia-inducible factor (HIF)-1alpha inhibitors. Bioorg Med Chem Lett17:6305-10 (2007) 
 
Hypoxia-inducible factor 1-alpha
Name:Hypoxia-inducible factor 1-alpha
Type:Protein
Mol. Mass.:92647.24
Organism:Homo sapiens (Human)
Description:Q16665
Residue:826
BDBM50206600
NameBDBM50206600
Synonyms:3-[2-(4-adamantan-1-yl-phenoxy)-acetylamino]-benzoic acid methyl ester | CHEMBL373396
TypeSmall organic molecule
Emp. Form.C26H29NO4
Mol. Mass.419.5128
SMILESCOC(=O)c1cccc(NC(=O)COc2ccc(cc2)C23CC4CC(CC(C4)C2)C3)c1