Reaction Details
TargetPeptide deformylase
LigandBDBM50222943
Substrate/Competitorn/a
Meas. Tech.ChEMBL_459563 (CHEMBL925663)
IC50 61500±n/a nM
Citation Zheng, CJLee, SLee, CHKim, WG Macrolactins O-R, glycosylated 24-membered lactones from Bacillus sp. AH159-1. J Nat Prod70:1632-5 (2007) 
 
Peptide deformylase
Name:Peptide deformylase
Type:PROTEIN
Mol. Mass.:20556.80
Organism:Staphylococcus aureus (strain Mu50 / ATCC 700699)
Description:ChEMBL_459563
Residue:183
BDBM50222943
NameBDBM50222943
Synonyms:CHEMBL399871 | macrolactin R
TypeSmall organic molecule
Emp. Form.C30H44O10
Mol. Mass.564.6644
SMILESC[C@@H]1CCC\C=C\C=C\[C@H](O)C[C@@H](O)C\C=C\C=C\[C@H](C\C=C\C=C/C(=O)O1)O[C@H]1O[C@@H](CO)[C@H](O)[C@@H](O)[C@@H]1O