Reaction Details
TargetCorticotropin-releasing factor receptor 1
LigandBDBM50223004
Substrate/Competitorn/a
Meas. Tech.ChEMBL_458068 (CHEMBL925405)
Ki 30±n/a nM
Citation Corbett, JWRauckhorst, MRQian, FHoffman, RLKnauer, CSFitzgerald, LW Heteroatom-linked indanylpyrazines are corticotropin releasing factor type-1 receptor antagonists. Bioorg Med Chem Lett17:6250-6 (2007) 
 
Corticotropin-releasing factor receptor 1
Name:Corticotropin-releasing factor receptor 1
Type:Enzyme
Mol. Mass.:50744.31
Organism:Homo sapiens (Human)
Description:P34998
Residue:444
BDBM50223004
NameBDBM50223004
Synonyms:3,6-diethyl-5-(4-methylpyridin-2-yloxy)-N-((1R,2S)-2-propoxy-2,3-dihydro-1H-inden-1-yl)pyrazin-2-amine | CHEMBL398258
TypeSmall organic molecule
Emp. Form.C26H32N4O2
Mol. Mass.432.5579
SMILESCCCO[C@H]1Cc2ccccc2[C@H]1Nc1nc(CC)c(Oc2cc(C)ccn2)nc1CC