Reaction Details
TargetCorticotropin-releasing factor receptor 1
LigandBDBM50223017
Substrate/Competitorn/a
Meas. Tech.ChEMBL_458068 (CHEMBL925405)
Ki 82±n/a nM
Citation Corbett, JWRauckhorst, MRQian, FHoffman, RLKnauer, CSFitzgerald, LW Heteroatom-linked indanylpyrazines are corticotropin releasing factor type-1 receptor antagonists. Bioorg Med Chem Lett17:6250-6 (2007) 
 
Corticotropin-releasing factor receptor 1
Name:Corticotropin-releasing factor receptor 1
Type:Enzyme
Mol. Mass.:50744.31
Organism:Homo sapiens (Human)
Description:P34998
Residue:444
BDBM50223017
NameBDBM50223017
Synonyms:2-((1R,2S)-1-(3,6-diethyl-5-(4-methylpyridin-2-yloxy)pyrazin-2-ylamino)-2,3-dihydro-1H-inden-2-yloxy)ethanol | CHEMBL400082
TypeSmall organic molecule
Emp. Form.C25H30N4O3
Mol. Mass.434.5307
SMILESCCc1nc(Oc2cc(C)ccn2)c(CC)nc1N[C@H]1[C@H](Cc2ccccc12)OCCO