Reaction Details
Target5-hydroxytryptamine receptor 6
LigandBDBM50223290
Substrate/Competitorn/a
Meas. Tech.ChEMBL_458154 (CHEMBL924411)
Ki 80±n/a nM
Citation Tasler, SKraus, JWuzik, AMüller, OAschenbrenner, ACubero, EPascual, RQuintana-Ruiz, JRDordal, AMercè, RCodony, X Discovery of 5-HT6 receptor ligands based on virtual HTS. Bioorg Med Chem Lett17:6224-9 (2007) 
 
5-hydroxytryptamine receptor 6
Name:5-hydroxytryptamine receptor 6
Type:G Protein-Coupled Receptor (GPCR)
Mol. Mass.:46968.43
Organism:Homo sapiens (Human)
Description:P50406
Residue:440
BDBM50223290
NameBDBM50223290
Synonyms:CHEMBL398337 | N-(2-(4-tert-butylphenoxy)ethyl)-5-(4-methylpiperazin-1-yl)-2-nitrobenzenamine
TypeSmall organic molecule
Emp. Form.C23H32N4O3
Mol. Mass.412.5252
SMILESCN1CCN(CC1)c1ccc(c(NCCOc2ccc(cc2)C(C)(C)C)c1)[N+]([O-])=O