Reaction Details
Target5-hydroxytryptamine receptor 6
LigandBDBM50223309
Substrate/Competitorn/a
Meas. Tech.ChEMBL_458154 (CHEMBL924411)
Ki 26±n/a nM
Citation Tasler, SKraus, JWuzik, AMüller, OAschenbrenner, ACubero, EPascual, RQuintana-Ruiz, JRDordal, AMercè, RCodony, X Discovery of 5-HT6 receptor ligands based on virtual HTS. Bioorg Med Chem Lett17:6224-9 (2007) 
 
5-hydroxytryptamine receptor 6
Name:5-hydroxytryptamine receptor 6
Type:G Protein-Coupled Receptor (GPCR)
Mol. Mass.:46968.43
Organism:Homo sapiens (Human)
Description:P50406
Residue:440
BDBM50223309
NameBDBM50223309
Synonyms:5-(4-methylpiperazin-1-yl)-2-nitro-N-(2-(o-tolyloxy)ethyl)benzenamine | CHEMBL248846
TypeSmall organic molecule
Emp. Form.C20H26N4O3
Mol. Mass.370.4454
SMILESCN1CCN(CC1)c1ccc(c(NCCOc2ccccc2C)c1)[N+]([O-])=O