Reaction Details
TargetSerine/threonine-protein kinase Chk1
LigandBDBM50223485
Substrate/Competitorn/a
Meas. Tech.ChEMBL_458175 (CHEMBL924433)
IC50 2±n/a nM
Citation Garbaccio, RMHuang, STasber, ESFraley, MEYan, YMunshi, SIkuta, MKuo, LKreatsoulas, CStirdivant, SDrakas, BRickert, KWalsh, ESHamilton, KABuser, CAHardwick, JMao, XBeck, SCAbrams, MTTao, WLobell, RSepp-Lorenzino, LHartman, GD Synthesis and evaluation of substituted benzoisoquinolinones as potent inhibitors of Chk1 kinase. Bioorg Med Chem Lett17:6280-5 (2007) 
 
Serine/threonine-protein kinase Chk1
Name:Serine/threonine-protein kinase Chk1
Type:Enzyme Catalytic Domain
Mol. Mass.:54443.02
Organism:Homo sapiens (Human)
Description:gi_166295192
Residue:476
BDBM50223485
NameBDBM50223485
Synonyms:6-(3-aminopropyl)-N-(2-(dimethylamino)ethyl)-1-oxo-1,2-dihydrobenzo[h]isoquinoline-9-carboxamide | CHEMBL249238
TypeSmall organic molecule
Emp. Form.C21H26N4O2
Mol. Mass.366.4567
SMILESCN(C)CCNC(=O)c1ccc2c(CCCN)cc3cc[nH]c(=O)c3c2c1