Reaction Details
TargetMuscarinic acetylcholine receptor M2
LigandBDBM50223991
Substrate/Competitorn/a
Meas. Tech.ChEMBL_450372 (CHEMBL900655)
IC50 13.8±n/a nM
Citation Lainé, DIXie, HBuffet, NFoley, JJBuckley, PWebb, EFWiddowson, KLPalovich, MRBelmonte, KE Discovery of novel 8-azoniabicyclo[3.2.1]octane carbamates as muscarinic acetylcholine receptor antagonists. Bioorg Med Chem Lett17:6066-9 (2007) 
 
Muscarinic acetylcholine receptor M2
Name:Muscarinic acetylcholine receptor M2
Type:GPCR
Mol. Mass.:51730.61
Organism:Homo sapiens (Human)
Description:P08172
Residue:466
BDBM50223991
NameBDBM50223991
Synonyms:3-(benzyl-thiophen-2-yl-carbamoyloxy)-8,8-dimethyl-8-azonia-bicyclo[3.2.1]octane; bromide | CHEMBL237741
TypeSmall organic molecule
Emp. Form.C21H27N2O2S
Mol. Mass.371.516
SMILESC[N+]1(C)C2CCC1CC(C2)OC(=O)N(Cc1ccccc1)c1cccs1