Reaction Details
TargetMuscarinic acetylcholine receptor M3
LigandBDBM50223992
Substrate/Competitorn/a
Meas. Tech.ChEMBL_450373 (CHEMBL900657)
IC50 20.3±n/a nM
Citation Lainé, DIXie, HBuffet, NFoley, JJBuckley, PWebb, EFWiddowson, KLPalovich, MRBelmonte, KE Discovery of novel 8-azoniabicyclo[3.2.1]octane carbamates as muscarinic acetylcholine receptor antagonists. Bioorg Med Chem Lett17:6066-9 (2007) 
 
Muscarinic acetylcholine receptor M3
Name:Muscarinic acetylcholine receptor M3
Type:Enzyme
Mol. Mass.:66151.03
Organism:Homo sapiens (Human)
Description:P20309
Residue:590
BDBM50223992
NameBDBM50223992
Synonyms:8-methyl-8-aza-bicyclo[3.2.1]octan-3-yl phenyl(thiophen-2-ylmethyl)carbamate | CHEMBL237955
TypeSmall organic molecule
Emp. Form.C20H24N2O2S
Mol. Mass.356.482
SMILESCN1C2CCC1CC(C2)OC(=O)N(Cc1cccs1)c1ccccc1