Reaction Details
TargetMuscarinic acetylcholine receptor M1
LigandBDBM50223970
Substrate/Competitorn/a
Meas. Tech.ChEMBL_450371 (CHEMBL900656)
IC50 12.2±n/a nM
Citation Lainé, DIXie, HBuffet, NFoley, JJBuckley, PWebb, EFWiddowson, KLPalovich, MRBelmonte, KE Discovery of novel 8-azoniabicyclo[3.2.1]octane carbamates as muscarinic acetylcholine receptor antagonists. Bioorg Med Chem Lett17:6066-9 (2007) 
 
Muscarinic acetylcholine receptor M1
Name:Muscarinic acetylcholine receptor M1
Type:Protein
Mol. Mass.:51442.54
Organism:Homo sapiens (Human)
Description:P11229
Residue:460
BDBM50223970
NameBDBM50223970
Synonyms:3-(furan-3-ylmethyl-phenyl-carbamoyloxy)-8,8-dimethyl-8-azonia-bicyclo[3.2.1]octane; bromide | CHEMBL237740
TypeSmall organic molecule
Emp. Form.C21H27N2O3
Mol. Mass.355.4501
SMILESC[N+]1(C)C2CCC1CC(C2)OC(=O)N(Cc1ccoc1)c1ccccc1