Reaction Details
TargetProstaglandin G/H synthase 2
LigandBDBM50224125
Substrate/Competitorn/a
Meas. Tech.ChEMBL_450439 (CHEMBL900723)
IC50 900±n/a nM
Citation Biava, MPorretta, GCPoce, GSupino, SForli, SRovini, MCappelli, AManetti, FBotta, MSautebin, LRossi, APergola, CGhelardini, CVivoli, EMakovec, FAnzellotti, PPatrignani, PAnzini, M Cyclooxygenase-2 inhibitors. 1,5-diarylpyrrol-3-acetic esters with enhanced inhibitory activity toward cyclooxygenase-2 and improved cyclooxygenase-2/cyclooxygenase-1 selectivity. J Med Chem50:5403-11 (2007) 
 
Prostaglandin G/H synthase 2
Name:Prostaglandin G/H synthase 2
Type:Protein
Mol. Mass.:69020.39
Organism:Mus musculus (Mouse)
Description:Q05769
Residue:604
BDBM50224125
NameBDBM50224125
Synonyms:CHEMBL393159 | ethyl-2-methyl-5-[4-(methylsulfonyl)phenyl]-1-[3-(fluoro)phenyl]-1H-pyrrol-3-glyoxylate
TypeSmall organic molecule
Emp. Form.C22H20FNO5S
Mol. Mass.429.461
SMILESCCOC(=O)C(=O)c1cc(-c2ccc(cc2)S(C)(=O)=O)n(c1C)-c1cccc(F)c1