Reaction Details
TargetProstaglandin G/H synthase 2
LigandBDBM50224129
Substrate/Competitorn/a
Meas. Tech.ChEMBL_450439 (CHEMBL900723)
IC50 10±n/a nM
Citation Biava, MPorretta, GCPoce, GSupino, SForli, SRovini, MCappelli, AManetti, FBotta, MSautebin, LRossi, APergola, CGhelardini, CVivoli, EMakovec, FAnzellotti, PPatrignani, PAnzini, M Cyclooxygenase-2 inhibitors. 1,5-diarylpyrrol-3-acetic esters with enhanced inhibitory activity toward cyclooxygenase-2 and improved cyclooxygenase-2/cyclooxygenase-1 selectivity. J Med Chem50:5403-11 (2007) 
 
Prostaglandin G/H synthase 2
Name:Prostaglandin G/H synthase 2
Type:Protein
Mol. Mass.:69020.39
Organism:Mus musculus (Mouse)
Description:Q05769
Residue:604
BDBM50224129
NameBDBM50224129
Synonyms:CHEMBL237626 | ethyl-2-methyl-5-[4-(methylsulfonyl)phenyl]-1-[4-(fluoro)-phenyl]-1H-pyrrol-3-acetate
TypeSmall organic molecule
Emp. Form.C22H22FNO4S
Mol. Mass.415.478
SMILESCCOC(=O)Cc1cc(-c2ccc(cc2)S(C)(=O)=O)n(c1C)-c1ccc(F)cc1