Reaction Details
TargetMelanocortin receptor 3
LigandBDBM50224177
Substrate/Competitorn/a
Meas. Tech.ChEMBL_450506 (CHEMBL900803)
Ki 270±n/a nM
Citation Chen, CJiang, WTucci, FTran, JAFleck, BAHoare, SRJoppa, MMarkison, SWen, JSai, YJohns, MMadan, AChen, TChen, CWMarinkovic, DArellano, MSaunders, JFoster, AC Discovery of 1-[2-[(1S)-(3-dimethylaminopropionyl)amino-2-methylpropyl]-4-methylphenyl]-4-[(2R)-methyl-3-(4-chlorophenyl)-propionyl]piperazine as an orally active antagonist of the melanocortin-4 receptor for the potential treatment of cachexia. J Med Chem50:5249-52 (2007) 
 
Melanocortin receptor 3
Name:Melanocortin receptor 3
Type:Enzyme
Mol. Mass.:36044.86
Organism:Homo sapiens (Human)
Description:P41968
Residue:323
BDBM50224177
NameBDBM50224177
Synonyms:1-{2-[(1S)-(aminopropionyl)amino-2-methylpropyl]-4-methylphenyl}-4-[(2R)-methyl-3-(4-chlorophenyl)propionyl]piperazine CHEMBL240364
TypeSmall organic molecule
Emp. Form.C28H39ClN4O2
Mol. Mass.499.088
SMILESCC(C)[C@H](NC(=O)CCN)c1cc(C)ccc1N1CCN(CC1)C(=O)[C@H](C)Cc1ccc(Cl)cc1