Reaction Details
TargetMelanocortin receptor 4
LigandBDBM50224181
Substrate/Competitorn/a
Meas. Tech.ChEMBL_450504 (CHEMBL900801)
IC50 35±n/a nM
Citation Chen, CJiang, WTucci, FTran, JAFleck, BAHoare, SRJoppa, MMarkison, SWen, JSai, YJohns, MMadan, AChen, TChen, CWMarinkovic, DArellano, MSaunders, JFoster, AC Discovery of 1-[2-[(1S)-(3-dimethylaminopropionyl)amino-2-methylpropyl]-4-methylphenyl]-4-[(2R)-methyl-3-(4-chlorophenyl)-propionyl]piperazine as an orally active antagonist of the melanocortin-4 receptor for the potential treatment of cachexia. J Med Chem50:5249-52 (2007) 
 
Melanocortin receptor 4
Name:Melanocortin receptor 4
Type:Enzyme
Mol. Mass.:36949.50
Organism:Homo sapiens (Human)
Description:P32245
Residue:332
BDBM50224181
NameBDBM50224181
Synonyms:1-{2-[(1S)-(3-dimethylaminopropionyl)amino-2-methylpropyl]-4-methylphenyl}-4-[(2R)-methyl-3-(4-chlorophenyl)propionyl]piperazine N-((S)-1-(2-(4-((R)-3-(4-chlorophenyl)-2-methylpropanoyl)piperazin-1-yl)-5-methylphenyl)-2-methylpropyl)-3-(dimethylamino)propanamide
TypeSmall organic molecule
Emp. Form.C30H43ClN4O2
Mol. Mass.527.141
SMILESCC(C)[C@H](NC(=O)CCN(C)C)c1cc(C)ccc1N1CCN(CC1)C(=O)[C@H](C)Cc1ccc(Cl)cc1