Reaction Details
TargetMelanocortin receptor 4
LigandBDBM50224178
Substrate/Competitorn/a
Meas. Tech.ChEMBL_450502 (CHEMBL900799)
Ki 6±n/a nM
Citation Chen, CJiang, WTucci, FTran, JAFleck, BAHoare, SRJoppa, MMarkison, SWen, JSai, YJohns, MMadan, AChen, TChen, CWMarinkovic, DArellano, MSaunders, JFoster, AC Discovery of 1-[2-[(1S)-(3-dimethylaminopropionyl)amino-2-methylpropyl]-4-methylphenyl]-4-[(2R)-methyl-3-(4-chlorophenyl)-propionyl]piperazine as an orally active antagonist of the melanocortin-4 receptor for the potential treatment of cachexia. J Med Chem50:5249-52 (2007) 
 
Melanocortin receptor 4
Name:Melanocortin receptor 4
Type:Enzyme
Mol. Mass.:36949.50
Organism:Homo sapiens (Human)
Description:P32245
Residue:332
BDBM50224178
NameBDBM50224178
Synonyms:(R)-3-(4-chloro-2-fluorophenyl)-2-methyl-1-(4-(4-methyl-2-((S)-2-methyl-1-(2-(methylamino)ethylamino)propyl)phenyl)piperazin-1-yl)propan-1-one CHEMBL240568
TypeSmall organic molecule
Emp. Form.C28H40ClFN4O
Mol. Mass.503.095
SMILESCNCCN[C@@H](C(C)C)c1cc(C)ccc1N1CCN(CC1)C(=O)[C@H](C)Cc1ccc(Cl)cc1F