Reaction Details
TargetSerine/threonine-protein kinase Chk2
LigandBDBM50224986
Substrate/Competitorn/a
Meas. Tech.ChEMBL_458529 (CHEMBL942788)
IC50 70±n/a nM
Citation Neff, DKLee-Dutra, ABlevitt, JMAxe, FUHack, MDBuma, JCRynberg, RBrunmark, AKarlsson, LBreitenbucher, JG 2-Aryl benzimidazoles featuring alkyl-linked pendant alcohols and amines as inhibitors of checkpoint kinase Chk2. Bioorg Med Chem Lett17:6467-71 (2007) 
 
Serine/threonine-protein kinase Chk2
Name:Serine/threonine-protein kinase Chk2
Type:Protein
Mol. Mass.:60908.59
Organism:Homo sapiens (Human)
Description:O96017
Residue:543
BDBM50224986
NameBDBM50224986
Synonyms:2-{4-[1-(4-methyl-benzyl)-piperidin-4-ylmethoxy]-phenyl}-1H-benzoimidazole-5-carboxylic acid amide | CHEMBL398467
TypeSmall organic molecule
Emp. Form.C28H30N4O2
Mol. Mass.454.5634
SMILESCc1ccc(CN2CCC(COc3ccc(cc3)-c3nc4ccc(cc4[nH]3)C(N)=O)CC2)cc1