Reaction Details
TargetSerine/threonine-protein kinase Chk2
LigandBDBM50224992
Substrate/Competitorn/a
Meas. Tech.ChEMBL_458529 (CHEMBL942788)
IC50 80±n/a nM
Citation Neff, DKLee-Dutra, ABlevitt, JMAxe, FUHack, MDBuma, JCRynberg, RBrunmark, AKarlsson, LBreitenbucher, JG 2-Aryl benzimidazoles featuring alkyl-linked pendant alcohols and amines as inhibitors of checkpoint kinase Chk2. Bioorg Med Chem Lett17:6467-71 (2007) 
 
Serine/threonine-protein kinase Chk2
Name:Serine/threonine-protein kinase Chk2
Type:Protein
Mol. Mass.:60908.59
Organism:Homo sapiens (Human)
Description:O96017
Residue:543
BDBM50224992
NameBDBM50224992
Synonyms:2-(4-(4-hydroxycyclohexyloxy)phenyl)-1H-benzo[d]imidazole-5-carboxamide | CHEMBL249569
TypeSmall organic molecule
Emp. Form.C20H21N3O3
Mol. Mass.351.399
SMILESNC(=O)c1ccc2nc([nH]c2c1)-c1ccc(OC2CCC(O)CC2)cc1