Reaction Details
TargetSerine/threonine-protein kinase Chk2
LigandBDBM50224994
Substrate/Competitorn/a
Meas. Tech.ChEMBL_458529 (CHEMBL942788)
IC50 74±n/a nM
Citation Neff, DKLee-Dutra, ABlevitt, JMAxe, FUHack, MDBuma, JCRynberg, RBrunmark, AKarlsson, LBreitenbucher, JG 2-Aryl benzimidazoles featuring alkyl-linked pendant alcohols and amines as inhibitors of checkpoint kinase Chk2. Bioorg Med Chem Lett17:6467-71 (2007) 
 
Serine/threonine-protein kinase Chk2
Name:Serine/threonine-protein kinase Chk2
Type:Protein
Mol. Mass.:60908.59
Organism:Homo sapiens (Human)
Description:O96017
Residue:543
BDBM50224994
NameBDBM50224994
Synonyms:2-(4-(2-(1-(4-methoxybenzyl)piperidin-2-yl)ethoxy)phenyl)-1H-benzo[d]imidazole-5-carboxamide | CHEMBL250957
TypeSmall organic molecule
Emp. Form.C29H32N4O3
Mol. Mass.484.5894
SMILESCOc1ccc(CN2CCCCC2CCOc2ccc(cc2)-c2nc3ccc(cc3[nH]2)C(N)=O)cc1