Reaction Details
TargetSerine/threonine-protein kinase Chk2
LigandBDBM34064
Substrate/Competitorn/a
Meas. Tech.ChEMBL_458529 (CHEMBL942788)
IC50 15±n/a nM
Citation Neff, DKLee-Dutra, ABlevitt, JMAxe, FUHack, MDBuma, JCRynberg, RBrunmark, AKarlsson, LBreitenbucher, JG 2-Aryl benzimidazoles featuring alkyl-linked pendant alcohols and amines as inhibitors of checkpoint kinase Chk2. Bioorg Med Chem Lett17:6467-71 (2007) 
 
Serine/threonine-protein kinase Chk2
Name:Serine/threonine-protein kinase Chk2
Type:Protein
Mol. Mass.:60908.59
Organism:Homo sapiens (Human)
Description:O96017
Residue:543
BDBM34064
NameBDBM34064
Synonyms:2-arylbenzimidazole | CHEMBL179583
TypeSmall organic molecule
Emp. Form.C20H14ClN3O2
Mol. Mass.363.797
SMILESNC(=O)c1ccc2nc([nH]c2c1)-c1ccc(Oc2ccc(Cl)cc2)cc1